{"text_format":"1","workbook":"xlsx","n_sheets":13,"sheets":["Start","Nutzungsbed._terms of use","Basismaterial","Einbauten","Basis","WT","Sprache","Einbauten_Installations","Information","Wandtypen_Walltypes","Preise_Prices","Übersicht_Summary","Bestellung_Order"],"not_rendered":{"charts":0,"images":25,"macros":1,"external_links":0,"defined_names":165,"comments":5,"pivot_tables":0},"unopened":[],"bounds":{"document_bytes":16777216,"sheet_cells":100000,"rows_first":2000,"rows_last":500,"rows_between":2000,"halvings":0,"cell_chars":16384,"cell_head_chars":4096},"cells_cut":0,"cells_raw":0,"read":"whole","date_system":"1900"}

{"sheet":"Start","index":0,"n_rows":43,"n_cols":11,"rows_kept":43,"cut":false,"hidden":false,"merged":[]}
[]
[]
[null,null,null,null,null,null,null,null,"Bitte die Sprache auswählen"]
[null,null,null,null,null,null,null,null,"Please Choose language"]
[]
[]
[]
[null,null,null,null,null,null,null,null,{"$f":"gettext(\"A5\",Sprache!$D$1)","v":"Weiter mit Tabellenblatt \"Nutzungsbed._terms of use\" (siehe unten)"}]
[]
[]
{"$rows_left_out":34}
{"sheet":"Nutzungsbed._terms of use","index":1,"n_rows":82,"n_cols":13,"rows_kept":82,"cut":false,"hidden":false,"merged":[]}
[null,true]
[]
[{"$f":"gettext(\"B1\",Sprache!$D$1)","v":"Endbenutzer Lizenzvereinbarung für \"SANIT Schienensystem 996 für Trockenbau\""}]
[]
[{"$f":"gettext(\"B2\",Sprache!$D$1)","v":"Stand : 31.03.2023"},null,null,null,null,null,null,null,null,null,null,null,{"$f":"gettext(\"B49\",Sprache!$D$1)","v":"Hinweis ( ! ) : "}]
[null,null,null,null,null,null,null,null,null,null,null,null,{"$f":"gettext(\"B50\",Sprache!$D$1)","v":"Bitte Bestätigen Sie die Kenntnisnahme der"}]
[null,null,null,null,null,null,null,null,null,null,null,null,{"$f":"gettext(\"B51\",Sprache!$D$1)","v":"Nutzungsbedingungen am Ende des Textes."}]
[{"$f":"gettext(\"B3\",Sprache!$D$1)","v":"Bitte lesen Sie diese Vereinbarung sorgfältig durch bevor Sie die Software nutzen."}]
[]
[{"$f":"gettext(\"B4\",Sprache!$D$1)","v":"Eine Nutzung der Software in jeglicher Form setzt die Zustimmung zu folgender Vereinbarung voraus."},null,null,null,null,null,null,null,null,null,null,null,"© Sanitärtechnik Eisenberg GmbH (D.Krug, G.Müller, M.Höbbel)"]
{"$rows_left_out":73}
{"sheet":"Basismaterial","index":2,"n_rows":15,"n_cols":4,"rows_kept":15,"cut":false,"hidden":true,"merged":[]}
["Artikel-Nr.","Mengeneinheit","Verpackeinheit","Einbauzeit (min)"]
[]
["02.208.00..0000",{"$f":"gettext(\"G2\",Sprache!$D$1)","v":"m"},{"$f":"gettext(\"G2\",Sprache!$D$1)","v":"m"},3]
["02.596.00..0000",{"$f":"gettext(\"G3\",Sprache!$D$1)","v":"Kg"},{"$f":"gettext(\"G3\",Sprache!$D$1)","v":"Kg"},6]
["02.597.00..0000",{"$f":"gettext(\"G1\",Sprache!$D$1)","v":"Stück"},{"$f":"gettext(\"G1\",Sprache!$D$1)","v":"Stück"},0.15]
["03.332.00..0000",{"$f":"gettext(\"G1\",Sprache!$D$1)","v":"Stück"},{"$f":"gettext(\"G1\",Sprache!$D$1)","v":"Stück"},0.5]
["03.333.00..0000",{"$f":"gettext(\"G1\",Sprache!$D$1)","v":"Stück"},{"$f":"gettext(\"G1\",Sprache!$D$1)","v":"Stück"},1]
["03.346.00..0000",{"$f":"gettext(\"G2\",Sprache!$D$1)","v":"m"},{"$f":"gettext(\"G2\",Sprache!$D$1)","v":"m"},0.5]
["03.545.00..0000",{"$f":"gettext(\"G1\",Sprache!$D$1)","v":"Stück"},{"$f":"gettext(\"G1\",Sprache!$D$1)","v":"Stück"},3]
["03.723.00..0000",{"$f":"gettext(\"G1\",Sprache!$D$1)","v":"Stück"},{"$f":"gettext(\"G1\",Sprache!$D$1)","v":"Stück"},2]
{"$rows_left_out":6}
{"sheet":"Einbauten","index":3,"n_rows":51,"n_cols":12,"rows_kept":51,"cut":false,"hidden":true,"merged":[[0,7,0,10]]}
["Artikel-Nr.","Mengeneinheit","Verpack.einheit","Bauhöhe","Baubreite","Mindest-","Element/ Modul","Bedarf an notwendigem Zubehör je Stück",null,null,null,"Reduzierung Stab Wand"]
[null,null,null,"Element","Element/Modul","Einbautiefe","Einbauzeit","02.208.00..0000","03.332.00..0000","03.333.00..0000","03.754.00..0000","02.208.00..0000"]
[{"$f":"gettext(\"G4\",Sprache!$D$1)","v":"WC-Elemente"}]
["90.745.00..T000",{"$f":"gettext(\"G1\",Sprache!$D$1)","v":"Stück"},{"$f":"gettext(\"G1\",Sprache!$D$1)","v":"Stück"},{"$f":"820+35","v":855},{"$f":"525+100","v":625},155,19,0,4,0,1,-0.52]
["90.738.00..T000",{"$f":"gettext(\"G1\",Sprache!$D$1)","v":"Stück"},{"$f":"gettext(\"G1\",Sprache!$D$1)","v":"Stück"},{"$f":"985+35","v":1020},625,155,19,0,4,0,1,-0.52]
["90.743.00..T000",{"$f":"gettext(\"G1\",Sprache!$D$1)","v":"Stück"},{"$f":"gettext(\"G1\",Sprache!$D$1)","v":"Stück"},{"$f":"1120+35","v":1155},{"$f":"450+100","v":550},135,19,0,4,0,1,-0.52]
["90.735.00..T000",{"$f":"gettext(\"G1\",Sprache!$D$1)","v":"Stück"},{"$f":"gettext(\"G1\",Sprache!$D$1)","v":"Stück"},{"$f":"1120+35","v":1155},625,135,21,0,4,0,1,-0.52]
[{"$f":"gettext(\"G5\",Sprache!$D$1)","v":"Waschtisch- und Ausgussbecken-Elemente"}]
["90.672.00..T000",{"$f":"gettext(\"G1\",Sprache!$D$1)","v":"Stück"},{"$f":"gettext(\"G1\",Sprache!$D$1)","v":"Stück"},{"$f":"820+35","v":855},{"$f":"525+100","v":625},null,16,0,4,0,1,-0.52]
["90.669.00..T000",{"$f":"gettext(\"G1\",Sprache!$D$1)","v":"Stück"},{"$f":"gettext(\"G1\",Sprache!$D$1)","v":"Stück"},{"$f":"985+35","v":1020},625,null,16,0,4,0,1,-0.52]
{"$rows_left_out":42}
{"sheet":"Basis","index":4,"n_rows":1796,"n_cols":96,"rows_kept":1796,"cut":false,"hidden":true,"merged":[[1746,0,1770,0],[1771,0,1795,0],[1521,0,1545,0],[1546,0,1570,0],[1571,0,1595,0],[1596,0,1620,0],[1696,0,1720,0],[1721,0,1745,0],[1671,0,1695,0],[1621,0,1645,0],[1646,0,1670,0],[1260,0,1270,0],[1346,0,1370,0],[1371,0,1395,0],[1249,0,1259,0],[1271,0,1295,0],[1296,0,1320,0],[1155,0,1179,0],[1205,0,1215,0],[1216,0,1226,0],[1238,0,1248,0],[955,0,979,0],[980,0,1004,0],[1030,0,1054,0],[1227,0,1237,0],[1130,0,1154,0],[1055,0,1079,0],[1080,0,1104,0],[1105,0,1129,0],[1180,0,1204,0],[1496,0,1520,0],[1446,0,1470,0],[1321,0,1345,0],[1396,0,1420,0],[1421,0,1445,0],[1471,0,1495,0],[4,93,4,95],[5,0,29,0],[6,15,12,15],[180,0,204,0],[1005,0,1029,0],[930,0,954,0],[830,0,854,0],[855,0,879,0],[880,0,904,0],[905,0,929,0],[30,0,54,0],[55,0,79,0],[205,0,229,0],[230,0,254,0],[4,18,4,92],[555,0,579,0],[430,0,454,0],[505,0,529,0],[530,0,554,0],[455,0,479,0],[480,0,504,0],[80,0,104,0],[105,0,129,0],[130,0,154,0],[155,0,179,0],[405,0,429,0],[255,0,279,0],[280,0,304,0],[380,0,404,0],[305,0,329,0],[330,0,354,0],[355,0,379,0],[780,0,804,0],[805,0,829,0],[580,0,604,0],[605,0,629,0],[630,0,654,0],[655,0,679,0],[755,0,779,0],[680,0,704,0],[705,0,729,0],[730,0,754,0]]}
[]
[]
[]
[null,"Artikelnummer",{"$f":"Basismaterial!$A3","v":"02.208.00..0000"},{"$f":"Basismaterial!$A4","v":"02.596.00..0000"},{"$f":"Basismaterial!$A5","v":"02.597.00..0000"},{"$f":"Basismaterial!$A6","v":"03.332.00..0000"},{"$f":"Basismaterial!$A8","v":"03.346.00..0000"},{"$f":"Basismaterial!$A9","v":"03.545.00..0000"},{"$f":"Basismaterial!$A10","v":"03.723.00..0000"},{"$f":"Basismaterial!$A11","v":"03.723.00..S000"},{"$f":"Basismaterial!$A13","v":"04.070.00..0000"},{"$f":"Basismaterial!$A14","v":"16.032.00..0000"},{"$f":"Basismaterial!$A15","v":"17.115.00..S000"},"Nutzbare"]
[null,"Wandbreite (mm)",null,null,null,null,null,null,null,null,null,null,null,"Wandbreite",null,null,null,null,"Wandtypen",null,null,null,null,null,null,null,null,null,null,null,null,null,null,null,null,null,null,null,null,null,null,null,null,null,null,null,null,null,null,null,null,null,null,null,null,null,null,null,null,null,null,null,null,null,null,null,null,null,null,null,null,null,null,null,null,null,null,null,null,null,null,null,null,null,null,null,null,null,null,null,null,null,null,"Fehlermeldungen"]
["Wandtyp 1.1.1",5000,21.77,1.4000000000000001,165,7,11.71,7,4,null,null,2.75,7.1,{"$f":"B6-170","v":4830},null,null,null,null,"1.1.1","1.1.2","1.1.3","1.1.4","1.1.5","1.1.6","1.1.7","1.1.8","1.1.9","1.1.10","1.1.11","1.1.12","1.1.13","1.1.14","1.1.15","1.2.1","1.2.2","1.2.3","1.2.4","1.2.5","1.2.6","1.2.7","1.2.8","1.2.9","1.2.10","1.2.11","1.2.12","1.2.13","1.2.14","1.2.15","1.3.1","1.3.2","1.3.3","1.3.4","1.3.5","1.3.6","1.3.7","1.3.8","1.3.9","1.3.10","1.3.11","1.3.12","1.3.13","1.3.14","1.3.15","2.1","2.2","2.3","3.1.1","3.1.2","3.1.3","3.2.1","3.2.2","3.2.3","4.1.1","4.1.2","4.1.3","4.1.4","4.1.5","4.1.6","4.1.7","4.2.1","4.2.2","4.2.3","4.2.4","4.2.5","4.2.6","4.2.7","4.3.1","4.3.2","4.3.3","4.3.4","4.3.5","4.3.6","4.3.7"]
[null,4800,20.97,1.4000000000000001,159,7,11.309999999999999,7,4,null,null,2.75,6.8,{"$f":"B7-170","v":4630},null,"Bedingung","Mindestanzahl Wände","Stk",1,1,1,1,1,1,1,1,1,1,1,1,1,1,1,1,1,1,1,1,1,1,1,1,1,1,1,1,1,1,1,1,1,1,1,1,1,1,1,1,1,1,1,1,1,1,1,1,1,1,1,1,1,1,1,1,1,1,1,1,1,1,1,1,1,1,1,1,1,1,1,1,1,1,1,{"$f":"gettext(\"D1\",Sprache!$D$1)","v":"Die Anzahl der zu berechnenden Wände muss mindestens "},null,{"$f":"gettext(\"D2\",Sprache!$D$1)","v":" betragen ! Bitte Eingabe prüfen."}]
[null,4600,20.169999999999998,1.3,152,7,10.91,7,4,null,null,2.75,6.5,4430,null,null,"Minimale Wandbreite","mm",200,200,200,200,200,200,200,200,200,200,200,200,200,200,200,200,200,200,200,200,200,200,200,200,200,200,200,200,200,200,200,200,200,200,200,200,200,200,200,200,200,200,200,200,200,200,200,200,600,600,600,600,600,600,200,200,200,200,200,200,200,200,200,200,200,200,200,200,200,200,200,200,200,200,200,{"$f":"gettext(\"D3\",Sprache!$D$1)","v":"Es können nur Wandbreiten zwischen "},{"$f":"gettext(\"D6\",Sprache!$D$1)","v":" mm und "},{"$f":"gettext(\"D7\",Sprache!$D$1)","v":" mm berechnet werden ! Bitte Eingabe prüfen."}]
[null,4400,19.37,1.3,146,7,10.510000000000002,7,4,null,null,2.75,6.3,4230,null,null,"Maximale Wandbreite","mm",5000,5000,5000,5000,5000,5000,5000,5000,5000,5000,5000,5000,5000,5000,5000,5000,5000,5000,5000,5000,5000,5000,5000,5000,5000,5000,5000,5000,5000,5000,5000,5000,5000,5000,5000,5000,5000,5000,5000,5000,5000,5000,5000,5000,5000,5000,5000,5000,2600,2600,2600,2600,2600,2600,5000,5000,5000,5000,5000,5000,5000,5000,5000,5000,5000,5000,5000,5000,5000,5000,5000,5000,5000,5000,5000,{"$f":"gettext(\"D3\",Sprache!$D$1)","v":"Es können nur Wandbreiten zwischen "},{"$f":"gettext(\"D6\",Sprache!$D$1)","v":" mm und "},{"$f":"gettext(\"D7\",Sprache!$D$1)","v":" mm berechnet werden ! Bitte Eingabe prüfen."}]
[null,4200,18.57,1.2000000000000002,139,7,10.11,7,4,null,null,2.75,6,4030,null,null,"Minimale Wandtiefe","mm",155,255,120,155,255,120,155,255,120,155,255,120,155,255,120,155,255,120,155,255,120,155,255,120,155,255,120,155,255,120,155,255,120,155,255,120,155,255,120,155,255,120,155,255,120,120,120,120,200,255,316,200,255,316,120,155,255,120,155,255,120,120,155,255,120,155,255,120,120,155,255,120,155,255,120,{"$f":"gettext(\"D4\",Sprache!$D$1)","v":"Es können nur Wandtiefen zwischen "},{"$f":"gettext(\"D6\",Sprache!$D$1)","v":" mm und "},{"$f":"gettext(\"D7\",Sprache!$D$1)","v":" mm berechnet werden ! Bitte Eingabe prüfen."}]
{"$rows_left_out":1787}
{"sheet":"WT","index":5,"n_rows":127,"n_cols":40,"rows_kept":127,"cut":false,"hidden":true,"merged":[[108,1,110,1],[115,1,117,1],[6,13,11,13],[7,1,7,2],[9,1,9,2],[10,1,10,2],[11,1,11,2],[12,11,12,12],[34,1,35,1],[34,9,34,10],[34,11,35,11],[5,1,5,2],[5,3,5,6],[1,1,1,2],[1,3,1,6],[3,1,3,2],[3,3,3,6]]}
[null,{"$f":"IF(AND(D10=\"\",D11=\"\",D12=\"\",W19=0),\"\",IF(AND(D10=\"\",D11=\"\",D12=\"\",W19<>0),Y6&Y19,IF(X7=TRUE,IF(AND(X12=TRUE,X13=TRUE),IF(AND(X8=TRUE,X9=TRUE),IF(AND(X10=TRUE,X11=TRUE),IF(X23=TRUE,\"\",Y6&Y23),Y6&Y10),Y6&Y9),Y6&Y13),Y6&Y7)))","v":""},null,null,null,null,null,null,null,null,null,null,null,null,null,null,null,null,null,"Projekt :","Wandtyp","1.2.1",{"$f":"getpiktogramm($V$1)","v":"OK"},"Basis_WT_","WBreite_"]
[null,{"$f":"Wandtypen_Walltypes!E1","v":"Bauvorhaben / Projekt :"},null,{"$f":"Wandtypen_Walltypes!G1","v":0},null,null,null,{"$f":"Wandtypen_Walltypes!K1","v":"Projekt-Nr. :"},{"$f":"Wandtypen_Walltypes!L1","v":0}]
[]
[null,{"$f":"Wandtypen_Walltypes!E2","v":"Sachbearbeiter :"},null,{"$f":"Wandtypen_Walltypes!G2","v":0},null,null,null,{"$f":"Wandtypen_Walltypes!K2","v":"Datum :"},{"$f":"Wandtypen_Walltypes!L2","v":"00:00:00"}]
[]
[null,{"$f":"gettext(\"G11\",Sprache!$D$1)","v":"Wandbezeichnung :"},null,null,null,null,null,null,null,null,null,null,null,null,null,null,null,null,null,null,"Eingabecheck","Bedingung","Eingabe","Check",{"$f":"gettext(\"G34\",Sprache!$D$1)","v":"Fehler (!) : "}]
[null,null,null,null,null,null,null,{"$f":"gettext(CONCATENATE($U$1,\" \",$V$1,\"_\",\"1\"),Sprache!$D$1)","v":"Wandtyp 1.2.1"},null,null,null,null,null,{"$f":"IF(X21=TRUE,\"H= \"&D10&\" mm\",\"\")","v":""},null,null,null,null,null,null,"Mindestanzahl Wände",{"$f":"INDEX(Basis!$S$7:$CO$13,1,MATCH($V$1,Basis!$S$6:$CO$6,0))","v":1},{"$f":"$D$8","v":1},{"$f":"W7>=V7","v":true},{"$f":"CONCATENATE(Basis!CP7,V7,Basis!CQ7,Basis!CR7)","v":"Die Anzahl der zu berechnenden Wände muss mindestens 1 betragen ! Bitte Eingabe prüfen."}]
[null,{"$f":"gettext(\"G12\",Sprache!$D$1)","v":"Anzahl der Wände :"},null,1,null,null,null,{"$f":"gettext(CONCATENATE($U$1,\" \",$V$1,\"_\",\"2\"),Sprache!$D$1)","v":"Vorwand vor Massivwand - einseitig befestigt"},null,null,null,null,null,null,null,null,null,null,null,null,"Minimale Wandbreite",{"$f":"INDEX(Basis!$S$7:$CO$13,2,MATCH($V$1,Basis!$S$6:$CO$6,0))","v":200},{"$f":"IF($D$11=\"\",\"\",$D$11)","v":""},{"$f":"AND(W8>=V8,NOT(W8=\"\"))","v":false},{"$f":"CONCATENATE(Basis!CP8,V8,Basis!CQ8,V9,Basis!CR8)","v":"Es können nur Wandbreiten zwischen 200 mm und 5000 mm berechnet werden ! Bitte Eingabe prüfen."}]
[null,null,null,null,null,null,null,{"$f":"gettext(CONCATENATE($U$1,\" \",$V$1,\"_\",\"3\"),Sprache!$D$1)","v":"Halbhoch, Höhe H ab OKFFB bis 855 mm"},null,null,null,null,null,null,null,{"$f":"gettext(\"G39\",Sprache!$D$1)","v":"Hinweis ( ! ) : "},null,null,null,null,"Maximale Wandbreite",{"$f":"INDEX(Basis!$S$7:$CO$13,3,MATCH($V$1,Basis!$S$6:$CO$6,0))","v":5000},{"$f":"IF($D$11=\"\",\"\",$D$11)","v":""},{"$f":"AND(W9<=V9,NOT(W9=\"\"))","v":false},{"$f":"CONCATENATE(Basis!CP9,V8,Basis!CQ9,V9,Basis!CR9)","v":"Es können nur Wandbreiten zwischen 200 mm und 5000 mm berechnet werden ! Bitte Eingabe prüfen."}]
[null,{"$f":"IF($W$33=TRUE,gettext(\"G13\",Sprache!$D$1),gettext(\"G14\",Sprache!$D$1))","v":"Bauhöhe ab OKFFB :"},null,null,"mm",null,null,{"$f":"gettext(CONCATENATE($U$1,\" \",$V$1,\"_\",\"4\"),Sprache!$D$1)","v":"(Einbau Elemente nur bei Höhe H OKFFB 855 mm)"},null,null,null,null,null,null,null,{"$f":"gettext(\"G40\",Sprache!$D$1)","v":"Mit Hilfe des Feldes \"Anzahl der Wände\" können Wände mit gleichen"},null,null,null,null,"Minimale Wandtiefe",{"$f":"INDEX(Basis!$S$7:$CO$13,4,MATCH($V$1,Basis!$S$6:$CO$6,0))","v":155},{"$f":"IF($D$12=\"\",\"\",$D$12)","v":""},{"$f":"AND(W10>=V10,NOT(W10=\"\"))","v":false},{"$f":"CONCATENATE(Basis!CP10,V10,Basis!CQ10,V11,Basis!CR10)","v":"Es können nur Wandtiefen zwischen 155 mm und 215 mm berechnet werden ! Bitte Eingabe prüfen."}]
{"$rows_left_out":118}
{"sheet":"Sprache","index":6,"n_rows":1104,"n_cols":4,"rows_kept":1104,"cut":false,"hidden":true,"merged":[]}
[null,"Deutsch","Ausgewählt",1]
[null,"Englisch"]
[]
["TextID","Deutsch","Englisch"]
[]
[null,"Wandtypenbeschreibungen"]
[]
["Wandtyp 1.1.1_1","Wandtyp 1.1.1","Type of wall 1.1.1"]
["Wandtyp 1.1.1_2","Vorwand vor Massivwand - zweiseitig befestigt","Installation on a solid wall - fixed on both ends"]
["Wandtyp 1.1.1_3","Halbhoch, Höhe H ab OKFFB bis 855 mm","Medium high, Height H from FFL up to 855 mm"]
{"$rows_left_out":1095}
{"sheet":"Einbauten_Installations","index":7,"n_rows":127,"n_cols":40,"rows_kept":127,"cut":false,"hidden":true,"merged":[[6,13,11,13],[7,1,7,2],[12,11,12,12],[1,1,1,2],[1,3,1,6],[3,1,3,2],[3,3,3,6],[5,1,5,2],[5,3,5,6],[34,1,35,1],[34,9,34,10],[34,11,35,11],[108,1,110,1],[115,1,117,1]]}
[null,{"$f":"IF(AND(D10=\"\",D11=\"\",D12=\"\",W19=0),\"\",IF(AND(D10=\"\",D11=\"\",D12=\"\",W19<>0),Y6&Y19,IF(X7=TRUE,IF(AND(X12=TRUE,X13=TRUE),IF(AND(X8=TRUE,X9=TRUE),IF(AND(X10=TRUE,X11=TRUE),IF(X23=TRUE,\"\",Y6&Y23),Y6&Y10),Y6&Y9),Y6&Y13),Y6&Y7)))","v":""},null,null,null,null,null,null,null,null,null,null,null,null,null,null,null,null,null,"Projekt :","Wandtyp","1.1.1",{"$f":"getpiktogramm($V$1)","v":"OK"},"Basis_WT_","WBreite_"]
[null,{"$f":"Wandtypen_Walltypes!E1","v":"Bauvorhaben / Projekt :"},null,{"$f":"Wandtypen_Walltypes!G1","v":0},null,null,null,{"$f":"Wandtypen_Walltypes!K1","v":"Projekt-Nr. :"},{"$f":"Wandtypen_Walltypes!L1","v":0}]
[]
[null,{"$f":"Wandtypen_Walltypes!E2","v":"Sachbearbeiter :"},null,{"$f":"Wandtypen_Walltypes!G2","v":0},null,null,null,{"$f":"Wandtypen_Walltypes!K2","v":"Datum :"},{"$f":"Wandtypen_Walltypes!L2","v":"00:00:00"}]
[]
[null,{"$f":"gettext(\"G59\",Sprache!$D$1)","v":"Positionsbezeichnung :"}]
[]
[null,{"$f":"gettext(\"G12\",Sprache!$D$1)","v":"Anzahl der Wände :"},null,1]
[]
[]
{"$rows_left_out":118}
{"sheet":"Information","index":8,"n_rows":64,"n_cols":4,"rows_kept":64,"cut":false,"hidden":false,"merged":[]}
[null,{"$f":"gettext(\"C1\",Sprache!$D$1)","v":"Informationen zum SANIT Schienensystem 996 für Trockenbau"}]
[]
[]
[null,{"$f":"gettext(\"C2\",Sprache!$D$1)","v":"Stand : 31.03.2023"}]
[]
[null,"-",{"$f":"gettext(\"C3\",Sprache!$D$1)","v":"Schacht- und Vorwandsystem zur Trockenverkleidung für Sanitär-, Heizungs-, Lüftungs- und  Elektroinstallationen für innenliegende"}]
[null,null,{"$f":"gettext(\"C4\",Sprache!$D$1)","v":"Räume im Hochbau."}]
[]
[null,"-",{"$f":"gettext(\"C5\",Sprache!$D$1)","v":"System für selbsttragende Sanitär-Montageelemente und Sanitär-Montagemodule, bestehend aus symmetrischem Spezialprofil"}]
[null,null,{"$f":"gettext(\"C6\",Sprache!$D$1)","v":"35 x 35 mm, Eckverbindern, Bauwerksanschlüssen, Multiverbindern, mit Verbindungsset zur Vorwandelementmontage in das"}]
{"$rows_left_out":55}
{"sheet":"Wandtypen_Walltypes","index":9,"n_rows":34,"n_cols":21,"rows_kept":34,"cut":false,"hidden":false,"merged":[[28,1,30,1],[11,1,13,1],[21,1,22,1],[0,4,0,5],[0,6,0,8],[1,4,1,5],[1,6,1,8],[8,5,8,7],[8,8,8,10],[7,4,7,10],[8,12,8,14],[8,18,8,20],[7,11,7,20],[18,5,18,7],[17,4,17,7],[8,15,8,17],[33,6,37,8],[25,5,25,7],[25,8,25,10],[25,12,25,14],[24,4,24,14]]}
[null,{"$f":"gettext(\"E1\",Sprache!$D$1)","v":"Angaben zum Bauvorhaben/ Projekt :"},null,null,{"$f":"gettext(\"E5\",Sprache!$D$1)","v":"Bauvorhaben / Projekt :"},null,null,null,null,null,{"$f":"gettext(\"E7\",Sprache!$D$1)","v":"Projekt-Nr. :"}]
[null,{"$f":"gettext(\"E2\",Sprache!$D$1)","v":"( *freiwillig )"},null,null,{"$f":"gettext(\"E6\",Sprache!$D$1)","v":"Sachbearbeiter :"},null,null,null,null,null,{"$f":"gettext(\"E8\",Sprache!$D$1)","v":"Datum :"}]
[]
[]
[]
[null,{"$f":"gettext(\"E3\",Sprache!$D$1)","v":"Auswahl der Wandtypen :"},{"$f":"gettext(\"E4\",Sprache!$D$1)","v":"(Auswahl durch Klick auf entsprechende Schaltfläche !)"}]
[]
[null,null,null,null,{"$f":"gettext(\"E10\",Sprache!$D$1)","v":"Halbhohe Wände:"},null,null,null,null,null,null,{"$f":"gettext(\"E11\",Sprache!$D$1)","v":"Raumhohe Wände"}]
[null,{"$f":"gettext(\"E9\",Sprache!$D$1)","v":"Wandtyp"},{"$f":"gettext(\"E12\",Sprache!$D$1)","v":"Bauhöhe ab OKFFB :"},null,"mm",{"$f":"gettext(\"E23\",Sprache!$D$1)","v":"bis 855"},null,null,{"$f":"gettext(\"E24\",Sprache!$D$1)","v":"bis 1155"},null,null,"mm",{"$f":"gettext(\"E25\",Sprache!$D$1)","v":"bis 2600"},null,null,{"$f":"gettext(\"E26\",Sprache!$D$1)","v":"bis 3300"},null,null,{"$f":"gettext(\"E27\",Sprache!$D$1)","v":"bis 3900"}]
[null,null,{"$f":"gettext(\"E13\",Sprache!$D$1)","v":"Wandtiefe :"},null,"mm","155 - 215","255 - 315","120 - 600","155 - 215","255 - 315","120 - 600","mm","155 - 215","255 - 315","120 - 600","155 - 215","255 - 315","120 - 600","155 - 215","255 - 315","120 - 600"]
{"$rows_left_out":25}
{"sheet":"Preise_Prices","index":10,"n_rows":94,"n_cols":25,"rows_kept":94,"cut":false,"hidden":false,"merged":[[7,11,7,13],[7,16,7,18],[8,11,8,13],[8,16,8,18],[11,18,12,18],[85,11,86,12],[11,16,12,16],[11,1,12,1],[11,2,12,9],[11,11,12,11],[11,13,12,13]]}
[null,{"$f":"gettext(\"F1\",Sprache!$D$1)","v":"Auswahl der Artikelpreise und Stundensätze als Preisbasis für die Kalkulation"}]
[]
[null,null,{"$f":"gettext(\"F17\",Sprache!$D$1)","v":"ohne Preise kalkulieren"}]
[null,null,{"$f":"L8&\" - \"&L9","v":"Preise 1 - "},null,null,null,null,null,{"$f":"IF($Y$82>0,gettext(\"F12\",Sprache!$D$1),\"\")","v":""}]
[null,null,{"$f":"Q8&\" - \"&Q9","v":"Preise 2 - "},null,null,null,null,null,{"$f":"IF($Y$82>0,gettext(\"F13\",Sprache!$D$1),\"\")","v":""}]
[null,null,null,null,null,null,null,null,{"$f":"IF($Y$82>0,gettext(\"F14\",Sprache!$D$1),\"\")","v":""}]
[]
[null,null,null,null,null,null,null,null,null,null,null,{"$f":"gettext(\"F3\",Sprache!$D$1)","v":"Preise 1"},0,0,null,null,{"$f":"gettext(\"F4\",Sprache!$D$1)","v":"Preise 2"},0,0,null,null,null,null,"Gewählte Preisbasis:"]
[null,null,null,null,null,null,null,null,null,null,null,null,null,null,null,null,null,null,null,null,null,null,null,1]
[]
{"$rows_left_out":85}
{"sheet":"Übersicht_Summary","index":11,"n_rows":114,"n_cols":43,"rows_kept":114,"cut":false,"hidden":false,"merged":[[43,2,46,2],[48,3,48,5],[33,2,34,2],[18,14,27,14],[18,11,27,11],[18,16,27,16],[18,15,27,15],[18,12,27,12],[18,13,27,13],[36,2,39,2],[18,22,27,22],[18,20,27,20],[18,17,27,17],[18,19,27,19],[18,18,27,18],[18,21,27,21],[12,2,12,3],[18,9,27,9],[14,2,14,3],[16,2,16,3],[12,4,12,7],[14,4,14,7],[18,2,18,3],[18,27,27,27],[18,28,27,28],[18,39,27,39],[18,23,27,23],[18,24,27,24],[18,25,27,25],[18,26,27,26],[18,29,27,29],[18,30,27,30],[18,31,27,31],[18,32,27,32],[18,40,27,40],[18,37,27,37],[18,38,27,38],[18,33,27,33],[18,34,27,34],[18,35,27,35],[18,36,27,36]]}
[null,null,null,null,null,null,null,null,null,null,null,1,2,3,4,5,6,7,8,9,10,11,12,13,14,15,16,17,18,19,20,21,22,23,24,25,26,27,28,29,30]
[null,null,null,13,null,null,null,null,null,null,null,{"$f":"getsheet(L1,\"T1=Projekt :\",$D$2)","v":"Not found"},{"$f":"getsheet(M1,\"T1=Projekt :\",$D$2)","v":"Not found"},"Not found","Not found","Not found","Not found","Not found","Not found","Not found","Not found","Not found","Not found","Not found","Not found","Not found","Not found","Not found","Not found","Not found","Not found","Not found","Not found","Not found","Not found","Not found","Not found","Not found","Not found","Not found","Not found"]
[]
[]
[null,"X28",null,null,"Fehlerhafte Wandtypen ?",null,null,null,null,{"$f":"COUNTIF($L$5:$AO$5,FALSE)","v":0},null,{"$f":"IF(L$2<>\"Not Found\",INDIRECT(CONCATENATE(\"'\",L$2,\"'\",\"!\",$B5)),0)","v":0},{"$f":"IF(M$2<>\"Not Found\",INDIRECT(CONCATENATE(\"'\",M$2,\"'\",\"!\",$B5)),0)","v":0},0,0,0,0,0,0,0,0,0,0,0,0,0,0,0,0,0,0,0,0,0,0,0,0,0,0,0,0]
[null,"W111",null,null,"Verzicht auf Beplankung ?",null,null,null,null,{"$f":"COUNTIF($L$6:$AO$6,TRUE)","v":0},null,{"$f":"IF(L$2<>\"Not Found\",INDIRECT(CONCATENATE(\"'\",L$2,\"'\",\"!\",$B6)),0)","v":0},0,0,0,0,0,0,0,0,0,0,0,0,0,0,0,0,0,0,0,0,0,0,0,0,0,0,0,0,0]
[null,null,{"$f":"IF(OR(Preise_Prices!$Y$82>0,Preise_Prices!$Y$89=FALSE,J5>0),gettext(\"F12\",Sprache!$D$1),\"\")","v":""}]
[null,null,{"$f":"IF($J$5>0,gettext(\"H19\",Sprache!$D$1),IF(Preise_Prices!$Y$82>0,gettext(\"F13\",Sprache!$D$1),IF(Preise_Prices!$Y$89=FALSE,gettext(\"F15\",Sprache!$D$1),\"\")))","v":""}]
[null,null,{"$f":"IF($J$5>0,gettext(\"H20\",Sprache!$D$1),IF(Preise_Prices!$Y$82>0,gettext(\"F14\",Sprache!$D$1),IF(Preise_Prices!$Y$89=FALSE,gettext(\"F16\",Sprache!$D$1),\"\")))","v":""}]
[null,null,{"$f":"gettext(\"H21\",Sprache!$D$1)","v":"Für Ausdrucke bitte die Anzahl der benötigten Seiten eingeben (Anzeige über das Menü  Datei > Seitenansicht möglich, Druck über das Menü Datei > Drucken > Druckbereich)."}]
{"$rows_left_out":105}
{"sheet":"Bestellung_Order","index":12,"n_rows":101,"n_cols":17,"rows_kept":101,"cut":false,"hidden":false,"merged":[[13,8,13,11],[8,1,8,3],[8,5,8,6],[9,1,9,3],[10,1,10,3],[5,1,5,3],[5,5,5,6],[6,1,6,3],[7,1,7,3],[31,2,32,9],[10,8,10,11],[11,1,11,3],[11,5,11,6],[11,8,11,11],[17,5,17,6],[26,5,26,6],[20,1,20,3],[20,5,20,6],[12,8,12,11],[31,10,32,10],[14,1,14,3],[14,5,14,6],[31,11,32,11],[21,1,21,3],[22,1,22,3],[23,1,23,3],[23,5,23,6],[24,1,24,3],[31,1,32,1]]}
[null,{"$f":"IF(Übersicht_Summary!$J$5>0,gettext(\"I17\",Sprache!$D$1),\"\")","v":""}]
[null,{"$f":"gettext(\"I1\",Sprache!$D$1)","v":"Bestellung für SANIT Schienensystem 996 für Trockenbau"}]
[]
[]
[null,{"$f":"gettext(\"I2\",Sprache!$D$1)","v":"Firma :"},null,null,null,{"$f":"gettext(\"I3\",Sprache!$D$1)","v":"Kundennummer :"}]
[]
[null,null,null,null,null,null,null,null,{"$f":"gettext(\"I13\",Sprache!$D$1)","v":"*Bitte wenden Sie sich mit Ihrer Bestellung"}]
[null,null,null,null,null,{"$f":"gettext(\"I4\",Sprache!$D$1)","v":"Besteller / Ansprechpartner :"},null,null,{"$f":"gettext(\"I14\",Sprache!$D$1)","v":" an ihren Großhandelspartner !"}]
[]
[null,null,null,null,null,null,null,null,{"$f":"gettext(\"I15\",Sprache!$D$1)","v":"Ihr Großhandelspartner:"}]
{"$rows_left_out":91}